BDBM50394610 CHEMBL2164222
SMILES C[C@@H](O)c1nc(no1)-c1cccc2Nc3nc(ccc3CN(c12)S(=O)(=O)c1ccc(cc1)C(C)(C)C)C(F)(F)F
InChI Key InChIKey=CEDDFIPODUBZLL-OAHLLOKOSA-N
Data  1 IC50  3 EC50
  Tab Delimited (TSV)   2D SDfile   Computed 3D by Vconf -m prep SDfile
Find this compound or compounds like it in BindingDB:
Activity Spreadsheet -- Enzyme Inhibition Constant Data from BindingDB
Found 3 hits for monomerid = 50394610
TargetBombesin receptor subtype-3(Mus musculus)
TBA
Curated by ChEMBL
LigandPNGBDBM50394610(CHEMBL2164222)
Affinity DataEC50:  134nM. Assay description: Agonist activity at mouse BRS-3 expressed in HEK293AEQ cells assessed as bioluminescence for 10 mins by aequorin bioluminescence assay
In DepthDetails ArticlePubMed
TargetBombesin receptor subtype-3(Homo sapiens (Human))
TBA
Curated by ChEMBL
LigandPNGBDBM50394610(CHEMBL2164222)
Affinity DataIC50:  1.90nM. Assay description: Displacement of [125I]-dY-peptide from human BRS-3 expressed in NFAT-CHO cells after 2 hrs by by liquid scintillation counting
In DepthDetails ArticlePubMed
TargetBombesin receptor subtype-3(Homo sapiens (Human))
TBA
Curated by ChEMBL
LigandPNGBDBM50394610(CHEMBL2164222)
Affinity DataEC50:  69nM. Assay description: Agonist activity at human BRS-3 expressed in HEK293AEQ cells assessed as bioluminescence for 10 mins by aequorin bioluminescence assay
In DepthDetails ArticlePubMed